{"text_format":"3","workbook":"xlsx","n_sheets":4,"sheets":["元データ","懇談表","案内状","使用方法"],"not_rendered":{"images":5,"macros":1,"defined_names":2},"read":"whole","date_system":"1900"}

{"sheet":"元データ","index":0,"n_rows":48,"n_cols":22,"rows_kept":48,"merged":[[0,0,0,1],[1,0,1,1],[2,0,2,1]]}
["開始時刻→",null,"09:00:00",{"$nulls":3},"←に「日にち」と「氏名」「開始時刻」「懇談時間」「懇談回数」",{"$nulls":8},"解除ＰＷ\n↓"]
["懇談時間(分)→",null,"00:20:00",{"$nulls":3},"を入力して面談時間作成ボタンをクリックしてください。"]
["１日の懇談数→",null,20,"　　←最後の懇談のＮｏを入力してください。"]
[]
["日にち","懇談No","面談時間","氏名"]
["8月19日（水）",1,"9:00:～9:20:","瀬口拓弥",{"$nulls":13},"08:00:00","00:10:00",1,"09:00:00","09:20:00"]
["8月20日（木）",2,"9:20:～9:40:","上福元直人",{"$nulls":13},"08:10:00","00:15:00",2,"09:20:00","09:40:00"]
["8月21日（金）",3,"9:40:～10:00","松澤香輝",{"$nulls":13},"08:20:00","00:20:00",3,"09:40:00","10:00:00"]
["8月24日（月）",4,"10:00～10:20","長谷川徹",{"$nulls":13},"08:30:00","00:25:00",4,"10:00:00","10:20:00"]
["8月25日（火）",5,"10:20～10:40","田向泰輝",{"$nulls":13},"08:40:00","00:30:00",5,"10:20:00","10:40:00"]
[null,6,"10:40～11:00","ドゥシャン",{"$nulls":13},"08:50:00","00:35:00",6,"10:40:00","11:00:00"]
[null,7,"11:00～11:20","ジエゴ",{"$nulls":13},"09:00:00","00:40:00",7,"11:00:00","11:20:00"]
[null,8,"11:20～11:40","石井秀典",{"$nulls":13},"09:10:00",null,8,"11:20:00","11:40:00"]
[null,9,"11:40～12:00","福岡将太",{"$nulls":13},"09:20:00",null,9,"11:40:00","12:00:00"]
[null,10,"12:00～12:20","安部崇士",{"$nulls":13},"09:30:00",null,10,"12:00:00","12:20:00"]
[null,11,"12:20～12:40","秋山拓也",{"$nulls":13},"09:40:00",null,11,"12:20:00","12:40:00"]
[null,12,"12:40～13:00","吹ヶ徳喜",{"$nulls":13},"09:50:00",null,12,"12:40:00","13:00:00"]
[null,13,"13:00～13:20","奥田雄大",{"$nulls":13},"10:00:00",null,13,"13:00:00","13:20:00"]
[null,14,"13:20～13:40","内田航平",{"$nulls":13},"10:10:00",null,14,"13:20:00","13:40:00"]
[null,15,"13:40～14:00","小西雄大",{"$nulls":13},"10:20:00",null,15,"13:40:00","14:00:00"]
{"$rows_left_out":29}
{"sheet":"懇談表","index":1,"n_rows":54,"n_cols":13,"rows_kept":54,"merged":[[0,1,0,3],[3,8,3,10]]}
[null,"個別懇談表"]
["番号","氏名","日時","時間"]
[1,{"$f":"IF(元データ!D6=\"\",\"\",元データ!D6)","v":"瀬口拓弥"},{"$f":"IFERROR(INDEX(懇談表!$I$6:$M$6,IFERROR(MATCH(B3,懇談表!$I$7:$M$7,0),IFERROR(MATCH(B3,懇談表!$I$8:$M$8,0),IFERROR(MATCH(B3,懇談表!$I$9:$M$9,0),IFERROR(MATCH(B3,懇談表!$I$10:$M$10,0),IFERROR(MATCH(B3,懇談表!$I$11:$M$11,0),IFERROR(MATCH(B3,懇談表!$I$12:$M$12,0),IFERROR(MATCH(B3,懇談表!$I$13:$M$13,0),IFERROR(MATCH(B3,懇談表!$I$14:$M$14,0),IFERROR(MATCH(B3,懇談表!$I$15:$M$15,0),IFERROR(MATCH(B3,懇談表!$I$16:$M$16,0),IFERROR(MATCH(B3,懇談表!$I$17:$M$17,0),IFERROR(MATCH(B3,懇談表!$I$18:$M$18,0),IFERROR(MATCH(B3,懇談表!$I$19:$M$19,0),IFERROR(MATCH(B3,懇談表!$I$20:$M$20,0),IFERROR(MATCH(B3,懇談表!$I$21:$M$21,0),IFERROR(MATCH(B3,懇談表!$I$22:$M$22,0),111))))))))))))))))),\"\")","v":"8月21日（金）"},{"$f":"IFERROR(INDEX(懇談表!$H$7:$H$36,IFERROR(MATCH($B3,懇談表!$I$7:$I$22,0),IFERROR(MATCH($B3,懇談表!$J$7:$J$22,0),IFERROR(MATCH($B3,懇談表!$K$7:$K$22,0),IFERROR(MATCH($B3,懇談表!$L$7:$L$22,0),IFERROR(MATCH($B3,懇談表!$M$7:$M$22,0),MATCH($B3,懇談表!$L$7:$L$22,0))))))),\"\")","v":"9:40:～10:00"}]
[2,{"$f":"IF(元データ!D7=\"\",\"\",元データ!D7)","v":"上福元直人"},{"$f":"IFERROR(INDEX(懇談表!$I$6:$M$6,IFERROR(MATCH(B4,懇談表!$I$7:$M$7,0),IFERROR(MATCH(B4,懇談表!$I$8:$M$8,0),IFERROR(MATCH(B4,懇談表!$I$9:$M$9,0),IFERROR(MATCH(B4,懇談表!$I$10:$M$10,0),IFERROR(MATCH(B4,懇談表!$I$11:$M$11,0),IFERROR(MATCH(B4,懇談表!$I$12:$M$12,0),IFERROR(MATCH(B4,懇談表!$I$13:$M$13,0),IFERROR(MATCH(B4,懇談表!$I$14:$M$14,0),IFERROR(MATCH(B4,懇談表!$I$15:$M$15,0),IFERROR(MATCH(B4,懇談表!$I$16:$M$16,0),IFERROR(MATCH(B4,懇談表!$I$17:$M$17,0),IFERROR(MATCH(B4,懇談表!$I$18:$M$18,0),IFERROR(MATCH(B4,懇談表!$I$19:$M$19,0),IFERROR(MATCH(B4,懇談表!$I$20:$M$20,0),IFERROR(MATCH(B4,懇談表!$I$21:$M$21,0),IFERROR(MATCH(B4,懇談表!$I$22:$M$22,0),111))))))))))))))))),\"\")","v":"8月19日（水）"},{"$f":"IFERROR(INDEX(懇談表!$H$7:$H$36,IFERROR(MATCH($B4,懇談表!$I$7:$I$22,0),IFERROR(MATCH($B4,懇談表!$J$7:$J$22,0),IFERROR(MATCH($B4,懇談表!$K$7:$K$22,0),IFERROR(MATCH($B4,懇談表!$L$7:$L$22,0),IFERROR(MATCH($B4,懇談表!$M$7:$M$22,0),MATCH($B4,懇談表!$L$7:$L$22,0))))))),\"\")","v":"9:00:～9:20:"},{"$nulls":4},"懇談表"]
[3,{"$f":"IF(元データ!D8=\"\",\"\",元データ!D8)","v":"松澤香輝"},{"$f":"IFERROR(INDEX(懇談表!$I$6:$M$6,IFERROR(MATCH(B5,懇談表!$I$7:$M$7,0),IFERROR(MATCH(B5,懇談表!$I$8:$M$8,0),IFERROR(MATCH(B5,懇談表!$I$9:$M$9,0),IFERROR(MATCH(B5,懇談表!$I$10:$M$10,0),IFERROR(MATCH(B5,懇談表!$I$11:$M$11,0),IFERROR(MATCH(B5,懇談表!$I$12:$M$12,0),IFERROR(MATCH(B5,懇談表!$I$13:$M$13,0),IFERROR(MATCH(B5,懇談表!$I$14:$M$14,0),IFERROR(MATCH(B5,懇談表!$I$15:$M$15,0),IFERROR(MATCH(B5,懇談表!$I$16:$M$16,0),IFERROR(MATCH(B5,懇談表!$I$17:$M$17,0),IFERROR(MATCH(B5,懇談表!$I$18:$M$18,0),IFERROR(MATCH(B5,懇談表!$I$19:$M$19,0),IFERROR(MATCH(B5,懇談表!$I$20:$M$20,0),IFERROR(MATCH(B5,懇談表!$I$21:$M$21,0),IFERROR(MATCH(B5,懇談表!$I$22:$M$22,0),111))))))))))))))))),\"\")","v":"8月24日（月）"},{"$f":"IFERROR(INDEX(懇談表!$H$7:$H$36,IFERROR(MATCH($B5,懇談表!$I$7:$I$22,0),IFERROR(MATCH($B5,懇談表!$J$7:$J$22,0),IFERROR(MATCH($B5,懇談表!$K$7:$K$22,0),IFERROR(MATCH($B5,懇談表!$L$7:$L$22,0),IFERROR(MATCH($B5,懇談表!$M$7:$M$22,0),MATCH($B5,懇談表!$L$7:$L$22,0))))))),\"\")","v":"9:00:～9:20:"}]
[4,{"$f":"IF(元データ!D9=\"\",\"\",元データ!D9)","v":"長谷川徹"},{"$f":"IFERROR(INDEX(懇談表!$I$6:$M$6,IFERROR(MATCH(B6,懇談表!$I$7:$M$7,0),IFERROR(MATCH(B6,懇談表!$I$8:$M$8,0),IFERROR(MATCH(B6,懇談表!$I$9:$M$9,0),IFERROR(MATCH(B6,懇談表!$I$10:$M$10,0),IFERROR(MATCH(B6,懇談表!$I$11:$M$11,0),IFERROR(MATCH(B6,懇談表!$I$12:$M$12,0),IFERROR(MATCH(B6,懇談表!$I$13:$M$13,0),IFERROR(MATCH(B6,懇談表!$I$14:$M$14,0),IFERROR(MATCH(B6,懇談表!$I$15:$M$15,0),IFERROR(MATCH(B6,懇談表!$I$16:$M$16,0),IFERROR(MATCH(B6,懇談表!$I$17:$M$17,0),IFERROR(MATCH(B6,懇談表!$I$18:$M$18,0),IFERROR(MATCH(B6,懇談表!$I$19:$M$19,0),IFERROR(MATCH(B6,懇談表!$I$20:$M$20,0),IFERROR(MATCH(B6,懇談表!$I$21:$M$21,0),IFERROR(MATCH(B6,懇談表!$I$22:$M$22,0),111))))))))))))))))),\"\")","v":"8月20日（木）"},{"$f":"IFERROR(INDEX(懇談表!$H$7:$H$36,IFERROR(MATCH($B6,懇談表!$I$7:$I$22,0),IFERROR(MATCH($B6,懇談表!$J$7:$J$22,0),IFERROR(MATCH($B6,懇談表!$K$7:$K$22,0),IFERROR(MATCH($B6,懇談表!$L$7:$L$22,0),IFERROR(MATCH($B6,懇談表!$M$7:$M$22,0),MATCH($B6,懇談表!$L$7:$L$22,0))))))),\"\")","v":"11:00～11:20"},{"$nulls":3},"懇談時間",{"$f":"元データ!A6","v":"8月19日（水）"},{"$f":"元データ!A7","v":"8月20日（木）"},{"$f":"元データ!A8","v":"8月21日（金）"},{"$f":"元データ!A9","v":"8月24日（月）"},{"$f":"元データ!A10","v":"8月25日（火）"}]
[5,{"$f":"IF(元データ!D10=\"\",\"\",元データ!D10)","v":"田向泰輝"},{"$f":"IFERROR(INDEX(懇談表!$I$6:$M$6,IFERROR(MATCH(B7,懇談表!$I$7:$M$7,0),IFERROR(MATCH(B7,懇談表!$I$8:$M$8,0),IFERROR(MATCH(B7,懇談表!$I$9:$M$9,0),IFERROR(MATCH(B7,懇談表!$I$10:$M$10,0),IFERROR(MATCH(B7,懇談表!$I$11:$M$11,0),IFERROR(MATCH(B7,懇談表!$I$12:$M$12,0),IFERROR(MATCH(B7,懇談表!$I$13:$M$13,0),IFERROR(MATCH(B7,懇談表!$I$14:$M$14,0),IFERROR(MATCH(B7,懇談表!$I$15:$M$15,0),IFERROR(MATCH(B7,懇談表!$I$16:$M$16,0),IFERROR(MATCH(B7,懇談表!$I$17:$M$17,0),IFERROR(MATCH(B7,懇談表!$I$18:$M$18,0),IFERROR(MATCH(B7,懇談表!$I$19:$M$19,0),IFERROR(MATCH(B7,懇談表!$I$20:$M$20,0),IFERROR(MATCH(B7,懇談表!$I$21:$M$21,0),IFERROR(MATCH(B7,懇談表!$I$22:$M$22,0),111))))))))))))))))),\"\")","v":""},{"$f":"IFERROR(INDEX(懇談表!$H$7:$H$36,IFERROR(MATCH($B7,懇談表!$I$7:$I$22,0),IFERROR(MATCH($B7,懇談表!$J$7:$J$22,0),IFERROR(MATCH($B7,懇談表!$K$7:$K$22,0),IFERROR(MATCH($B7,懇談表!$L$7:$L$22,0),IFERROR(MATCH($B7,懇談表!$M$7:$M$22,0),MATCH($B7,懇談表!$L$7:$L$22,0))))))),\"\")","v":""},null,null,1,{"$f":"IF(元データ!C6=\"\",\"\",元データ!C6)","v":"9:00:～9:20:"},"上福元直人",null,null,"松澤香輝"]
[6,{"$f":"IF(元データ!D11=\"\",\"\",元データ!D11)","v":"ドゥシャン"},{"$f":"IFERROR(INDEX(懇談表!$I$6:$M$6,IFERROR(MATCH(B8,懇談表!$I$7:$M$7,0),IFERROR(MATCH(B8,懇談表!$I$8:$M$8,0),IFERROR(MATCH(B8,懇談表!$I$9:$M$9,0),IFERROR(MATCH(B8,懇談表!$I$10:$M$10,0),IFERROR(MATCH(B8,懇談表!$I$11:$M$11,0),IFERROR(MATCH(B8,懇談表!$I$12:$M$12,0),IFERROR(MATCH(B8,懇談表!$I$13:$M$13,0),IFERROR(MATCH(B8,懇談表!$I$14:$M$14,0),IFERROR(MATCH(B8,懇談表!$I$15:$M$15,0),IFERROR(MATCH(B8,懇談表!$I$16:$M$16,0),IFERROR(MATCH(B8,懇談表!$I$17:$M$17,0),IFERROR(MATCH(B8,懇談表!$I$18:$M$18,0),IFERROR(MATCH(B8,懇談表!$I$19:$M$19,0),IFERROR(MATCH(B8,懇談表!$I$20:$M$20,0),IFERROR(MATCH(B8,懇談表!$I$21:$M$21,0),IFERROR(MATCH(B8,懇談表!$I$22:$M$22,0),111))))))))))))))))),\"\")","v":""},{"$f":"IFERROR(INDEX(懇談表!$H$7:$H$36,IFERROR(MATCH($B8,懇談表!$I$7:$I$22,0),IFERROR(MATCH($B8,懇談表!$J$7:$J$22,0),IFERROR(MATCH($B8,懇談表!$K$7:$K$22,0),IFERROR(MATCH($B8,懇談表!$L$7:$L$22,0),IFERROR(MATCH($B8,懇談表!$M$7:$M$22,0),MATCH($B8,懇談表!$L$7:$L$22,0))))))),\"\")","v":""},null,null,2,{"$f":"IF(元データ!C7=\"\",\"\",元データ!C7)","v":"9:20:～9:40:"}]
[7,{"$f":"IF(元データ!D12=\"\",\"\",元データ!D12)","v":"ジエゴ"},{"$f":"IFERROR(INDEX(懇談表!$I$6:$M$6,IFERROR(MATCH(B9,懇談表!$I$7:$M$7,0),IFERROR(MATCH(B9,懇談表!$I$8:$M$8,0),IFERROR(MATCH(B9,懇談表!$I$9:$M$9,0),IFERROR(MATCH(B9,懇談表!$I$10:$M$10,0),IFERROR(MATCH(B9,懇談表!$I$11:$M$11,0),IFERROR(MATCH(B9,懇談表!$I$12:$M$12,0),IFERROR(MATCH(B9,懇談表!$I$13:$M$13,0),IFERROR(MATCH(B9,懇談表!$I$14:$M$14,0),IFERROR(MATCH(B9,懇談表!$I$15:$M$15,0),IFERROR(MATCH(B9,懇談表!$I$16:$M$16,0),IFERROR(MATCH(B9,懇談表!$I$17:$M$17,0),IFERROR(MATCH(B9,懇談表!$I$18:$M$18,0),IFERROR(MATCH(B9,懇談表!$I$19:$M$19,0),IFERROR(MATCH(B9,懇談表!$I$20:$M$20,0),IFERROR(MATCH(B9,懇談表!$I$21:$M$21,0),IFERROR(MATCH(B9,懇談表!$I$22:$M$22,0),111))))))))))))))))),\"\")","v":"8月21日（金）"},{"$f":"IFERROR(INDEX(懇談表!$H$7:$H$36,IFERROR(MATCH($B9,懇談表!$I$7:$I$22,0),IFERROR(MATCH($B9,懇談表!$J$7:$J$22,0),IFERROR(MATCH($B9,懇談表!$K$7:$K$22,0),IFERROR(MATCH($B9,懇談表!$L$7:$L$22,0),IFERROR(MATCH($B9,懇談表!$M$7:$M$22,0),MATCH($B9,懇談表!$L$7:$L$22,0))))))),\"\")","v":"12:00～12:20"},null,null,3,{"$f":"IF(元データ!C8=\"\",\"\",元データ!C8)","v":"9:40:～10:00"},null,null,"瀬口拓弥"]
[8,{"$f":"IF(元データ!D13=\"\",\"\",元データ!D13)","v":"石井秀典"},{"$f":"IFERROR(INDEX(懇談表!$I$6:$M$6,IFERROR(MATCH(B10,懇談表!$I$7:$M$7,0),IFERROR(MATCH(B10,懇談表!$I$8:$M$8,0),IFERROR(MATCH(B10,懇談表!$I$9:$M$9,0),IFERROR(MATCH(B10,懇談表!$I$10:$M$10,0),IFERROR(MATCH(B10,懇談表!$I$11:$M$11,0),IFERROR(MATCH(B10,懇談表!$I$12:$M$12,0),IFERROR(MATCH(B10,懇談表!$I$13:$M$13,0),IFERROR(MATCH(B10,懇談表!$I$14:$M$14,0),IFERROR(MATCH(B10,懇談表!$I$15:$M$15,0),IFERROR(MATCH(B10,懇談表!$I$16:$M$16,0),IFERROR(MATCH(B10,懇談表!$I$17:$M$17,0),IFERROR(MATCH(B10,懇談表!$I$18:$M$18,0),IFERROR(MATCH(B10,懇談表!$I$19:$M$19,0),IFERROR(MATCH(B10,懇談表!$I$20:$M$20,0),IFERROR(MATCH(B10,懇談表!$I$21:$M$21,0),IFERROR(MATCH(B10,懇談表!$I$22:$M$22,0),111))))))))))))))))),\"\")","v":""},{"$f":"IFERROR(INDEX(懇談表!$H$7:$H$36,IFERROR(MATCH($B10,懇談表!$I$7:$I$22,0),IFERROR(MATCH($B10,懇談表!$J$7:$J$22,0),IFERROR(MATCH($B10,懇談表!$K$7:$K$22,0),IFERROR(MATCH($B10,懇談表!$L$7:$L$22,0),IFERROR(MATCH($B10,懇談表!$M$7:$M$22,0),MATCH($B10,懇談表!$L$7:$L$22,0))))))),\"\")","v":""},null,null,4,{"$f":"IF(元データ!C9=\"\",\"\",元データ!C9)","v":"10:00～10:20"}]
[9,{"$f":"IF(元データ!D14=\"\",\"\",元データ!D14)","v":"福岡将太"},{"$f":"IFERROR(INDEX(懇談表!$I$6:$M$6,IFERROR(MATCH(B11,懇談表!$I$7:$M$7,0),IFERROR(MATCH(B11,懇談表!$I$8:$M$8,0),IFERROR(MATCH(B11,懇談表!$I$9:$M$9,0),IFERROR(MATCH(B11,懇談表!$I$10:$M$10,0),IFERROR(MATCH(B11,懇談表!$I$11:$M$11,0),IFERROR(MATCH(B11,懇談表!$I$12:$M$12,0),IFERROR(MATCH(B11,懇談表!$I$13:$M$13,0),IFERROR(MATCH(B11,懇談表!$I$14:$M$14,0),IFERROR(MATCH(B11,懇談表!$I$15:$M$15,0),IFERROR(MATCH(B11,懇談表!$I$16:$M$16,0),IFERROR(MATCH(B11,懇談表!$I$17:$M$17,0),IFERROR(MATCH(B11,懇談表!$I$18:$M$18,0),IFERROR(MATCH(B11,懇談表!$I$19:$M$19,0),IFERROR(MATCH(B11,懇談表!$I$20:$M$20,0),IFERROR(MATCH(B11,懇談表!$I$21:$M$21,0),IFERROR(MATCH(B11,懇談表!$I$22:$M$22,0),111))))))))))))))))),\"\")","v":""},{"$f":"IFERROR(INDEX(懇談表!$H$7:$H$36,IFERROR(MATCH($B11,懇談表!$I$7:$I$22,0),IFERROR(MATCH($B11,懇談表!$J$7:$J$22,0),IFERROR(MATCH($B11,懇談表!$K$7:$K$22,0),IFERROR(MATCH($B11,懇談表!$L$7:$L$22,0),IFERROR(MATCH($B11,懇談表!$M$7:$M$22,0),MATCH($B11,懇談表!$L$7:$L$22,0))))))),\"\")","v":""},null,null,5,{"$f":"IF(元データ!C10=\"\",\"\",元データ!C10)","v":"10:20～10:40"}]
[10,{"$f":"IF(元データ!D15=\"\",\"\",元データ!D15)","v":"安部崇士"},{"$f":"IFERROR(INDEX(懇談表!$I$6:$M$6,IFERROR(MATCH(B12,懇談表!$I$7:$M$7,0),IFERROR(MATCH(B12,懇談表!$I$8:$M$8,0),IFERROR(MATCH(B12,懇談表!$I$9:$M$9,0),IFERROR(MATCH(B12,懇談表!$I$10:$M$10,0),IFERROR(MATCH(B12,懇談表!$I$11:$M$11,0),IFERROR(MATCH(B12,懇談表!$I$12:$M$12,0),IFERROR(MATCH(B12,懇談表!$I$13:$M$13,0),IFERROR(MATCH(B12,懇談表!$I$14:$M$14,0),IFERROR(MATCH(B12,懇談表!$I$15:$M$15,0),IFERROR(MATCH(B12,懇談表!$I$16:$M$16,0),IFERROR(MATCH(B12,懇談表!$I$17:$M$17,0),IFERROR(MATCH(B12,懇談表!$I$18:$M$18,0),IFERROR(MATCH(B12,懇談表!$I$19:$M$19,0),IFERROR(MATCH(B12,懇談表!$I$20:$M$20,0),IFERROR(MATCH(B12,懇談表!$I$21:$M$21,0),IFERROR(MATCH(B12,懇談表!$I$22:$M$22,0),111))))))))))))))))),\"\")","v":""},{"$f":"IFERROR(INDEX(懇談表!$H$7:$H$36,IFERROR(MATCH($B12,懇談表!$I$7:$I$22,0),IFERROR(MATCH($B12,懇談表!$J$7:$J$22,0),IFERROR(MATCH($B12,懇談表!$K$7:$K$22,0),IFERROR(MATCH($B12,懇談表!$L$7:$L$22,0),IFERROR(MATCH($B12,懇談表!$M$7:$M$22,0),MATCH($B12,懇談表!$L$7:$L$22,0))))))),\"\")","v":""},null,null,6,{"$f":"IF(元データ!C11=\"\",\"\",元データ!C11)","v":"10:40～11:00"}]
[11,{"$f":"IF(元データ!D16=\"\",\"\",元データ!D16)","v":"秋山拓也"},{"$f":"IFERROR(INDEX(懇談表!$I$6:$M$6,IFERROR(MATCH(B13,懇談表!$I$7:$M$7,0),IFERROR(MATCH(B13,懇談表!$I$8:$M$8,0),IFERROR(MATCH(B13,懇談表!$I$9:$M$9,0),IFERROR(MATCH(B13,懇談表!$I$10:$M$10,0),IFERROR(MATCH(B13,懇談表!$I$11:$M$11,0),IFERROR(MATCH(B13,懇談表!$I$12:$M$12,0),IFERROR(MATCH(B13,懇談表!$I$13:$M$13,0),IFERROR(MATCH(B13,懇談表!$I$14:$M$14,0),IFERROR(MATCH(B13,懇談表!$I$15:$M$15,0),IFERROR(MATCH(B13,懇談表!$I$16:$M$16,0),IFERROR(MATCH(B13,懇談表!$I$17:$M$17,0),IFERROR(MATCH(B13,懇談表!$I$18:$M$18,0),IFERROR(MATCH(B13,懇談表!$I$19:$M$19,0),IFERROR(MATCH(B13,懇談表!$I$20:$M$20,0),IFERROR(MATCH(B13,懇談表!$I$21:$M$21,0),IFERROR(MATCH(B13,懇談表!$I$22:$M$22,0),111))))))))))))))))),\"\")","v":""},{"$f":"IFERROR(INDEX(懇談表!$H$7:$H$36,IFERROR(MATCH($B13,懇談表!$I$7:$I$22,0),IFERROR(MATCH($B13,懇談表!$J$7:$J$22,0),IFERROR(MATCH($B13,懇談表!$K$7:$K$22,0),IFERROR(MATCH($B13,懇談表!$L$7:$L$22,0),IFERROR(MATCH($B13,懇談表!$M$7:$M$22,0),MATCH($B13,懇談表!$L$7:$L$22,0))))))),\"\")","v":""},null,null,7,{"$f":"IF(元データ!C12=\"\",\"\",元データ!C12)","v":"11:00～11:20"},null,"長谷川徹"]
[12,{"$f":"IF(元データ!D17=\"\",\"\",元データ!D17)","v":"吹ヶ徳喜"},{"$f":"IFERROR(INDEX(懇談表!$I$6:$M$6,IFERROR(MATCH(B14,懇談表!$I$7:$M$7,0),IFERROR(MATCH(B14,懇談表!$I$8:$M$8,0),IFERROR(MATCH(B14,懇談表!$I$9:$M$9,0),IFERROR(MATCH(B14,懇談表!$I$10:$M$10,0),IFERROR(MATCH(B14,懇談表!$I$11:$M$11,0),IFERROR(MATCH(B14,懇談表!$I$12:$M$12,0),IFERROR(MATCH(B14,懇談表!$I$13:$M$13,0),IFERROR(MATCH(B14,懇談表!$I$14:$M$14,0),IFERROR(MATCH(B14,懇談表!$I$15:$M$15,0),IFERROR(MATCH(B14,懇談表!$I$16:$M$16,0),IFERROR(MATCH(B14,懇談表!$I$17:$M$17,0),IFERROR(MATCH(B14,懇談表!$I$18:$M$18,0),IFERROR(MATCH(B14,懇談表!$I$19:$M$19,0),IFERROR(MATCH(B14,懇談表!$I$20:$M$20,0),IFERROR(MATCH(B14,懇談表!$I$21:$M$21,0),IFERROR(MATCH(B14,懇談表!$I$22:$M$22,0),111))))))))))))))))),\"\")","v":""},{"$f":"IFERROR(INDEX(懇談表!$H$7:$H$36,IFERROR(MATCH($B14,懇談表!$I$7:$I$22,0),IFERROR(MATCH($B14,懇談表!$J$7:$J$22,0),IFERROR(MATCH($B14,懇談表!$K$7:$K$22,0),IFERROR(MATCH($B14,懇談表!$L$7:$L$22,0),IFERROR(MATCH($B14,懇談表!$M$7:$M$22,0),MATCH($B14,懇談表!$L$7:$L$22,0))))))),\"\")","v":""},null,null,8,{"$f":"IF(元データ!C13=\"\",\"\",元データ!C13)","v":"11:20～11:40"}]
[13,{"$f":"IF(元データ!D18=\"\",\"\",元データ!D18)","v":"奥田雄大"},{"$f":"IFERROR(INDEX(懇談表!$I$6:$M$6,IFERROR(MATCH(B15,懇談表!$I$7:$M$7,0),IFERROR(MATCH(B15,懇談表!$I$8:$M$8,0),IFERROR(MATCH(B15,懇談表!$I$9:$M$9,0),IFERROR(MATCH(B15,懇談表!$I$10:$M$10,0),IFERROR(MATCH(B15,懇談表!$I$11:$M$11,0),IFERROR(MATCH(B15,懇談表!$I$12:$M$12,0),IFERROR(MATCH(B15,懇談表!$I$13:$M$13,0),IFERROR(MATCH(B15,懇談表!$I$14:$M$14,0),IFERROR(MATCH(B15,懇談表!$I$15:$M$15,0),IFERROR(MATCH(B15,懇談表!$I$16:$M$16,0),IFERROR(MATCH(B15,懇談表!$I$17:$M$17,0),IFERROR(MATCH(B15,懇談表!$I$18:$M$18,0),IFERROR(MATCH(B15,懇談表!$I$19:$M$19,0),IFERROR(MATCH(B15,懇談表!$I$20:$M$20,0),IFERROR(MATCH(B15,懇談表!$I$21:$M$21,0),IFERROR(MATCH(B15,懇談表!$I$22:$M$22,0),111))))))))))))))))),\"\")","v":""},{"$f":"IFERROR(INDEX(懇談表!$H$7:$H$36,IFERROR(MATCH($B15,懇談表!$I$7:$I$22,0),IFERROR(MATCH($B15,懇談表!$J$7:$J$22,0),IFERROR(MATCH($B15,懇談表!$K$7:$K$22,0),IFERROR(MATCH($B15,懇談表!$L$7:$L$22,0),IFERROR(MATCH($B15,懇談表!$M$7:$M$22,0),MATCH($B15,懇談表!$L$7:$L$22,0))))))),\"\")","v":""},null,null,9,{"$f":"IF(元データ!C14=\"\",\"\",元データ!C14)","v":"11:40～12:00"}]
[14,{"$f":"IF(元データ!D19=\"\",\"\",元データ!D19)","v":"内田航平"},{"$f":"IFERROR(INDEX(懇談表!$I$6:$M$6,IFERROR(MATCH(B16,懇談表!$I$7:$M$7,0),IFERROR(MATCH(B16,懇談表!$I$8:$M$8,0),IFERROR(MATCH(B16,懇談表!$I$9:$M$9,0),IFERROR(MATCH(B16,懇談表!$I$10:$M$10,0),IFERROR(MATCH(B16,懇談表!$I$11:$M$11,0),IFERROR(MATCH(B16,懇談表!$I$12:$M$12,0),IFERROR(MATCH(B16,懇談表!$I$13:$M$13,0),IFERROR(MATCH(B16,懇談表!$I$14:$M$14,0),IFERROR(MATCH(B16,懇談表!$I$15:$M$15,0),IFERROR(MATCH(B16,懇談表!$I$16:$M$16,0),IFERROR(MATCH(B16,懇談表!$I$17:$M$17,0),IFERROR(MATCH(B16,懇談表!$I$18:$M$18,0),IFERROR(MATCH(B16,懇談表!$I$19:$M$19,0),IFERROR(MATCH(B16,懇談表!$I$20:$M$20,0),IFERROR(MATCH(B16,懇談表!$I$21:$M$21,0),IFERROR(MATCH(B16,懇談表!$I$22:$M$22,0),111))))))))))))))))),\"\")","v":""},{"$f":"IFERROR(INDEX(懇談表!$H$7:$H$36,IFERROR(MATCH($B16,懇談表!$I$7:$I$22,0),IFERROR(MATCH($B16,懇談表!$J$7:$J$22,0),IFERROR(MATCH($B16,懇談表!$K$7:$K$22,0),IFERROR(MATCH($B16,懇談表!$L$7:$L$22,0),IFERROR(MATCH($B16,懇談表!$M$7:$M$22,0),MATCH($B16,懇談表!$L$7:$L$22,0))))))),\"\")","v":""},null,null,10,{"$f":"IF(元データ!C15=\"\",\"\",元データ!C15)","v":"12:00～12:20"},null,null,"ジエゴ"]
[15,{"$f":"IF(元データ!D20=\"\",\"\",元データ!D20)","v":"小西雄大"},{"$f":"IFERROR(INDEX(懇談表!$I$6:$M$6,IFERROR(MATCH(B17,懇談表!$I$7:$M$7,0),IFERROR(MATCH(B17,懇談表!$I$8:$M$8,0),IFERROR(MATCH(B17,懇談表!$I$9:$M$9,0),IFERROR(MATCH(B17,懇談表!$I$10:$M$10,0),IFERROR(MATCH(B17,懇談表!$I$11:$M$11,0),IFERROR(MATCH(B17,懇談表!$I$12:$M$12,0),IFERROR(MATCH(B17,懇談表!$I$13:$M$13,0),IFERROR(MATCH(B17,懇談表!$I$14:$M$14,0),IFERROR(MATCH(B17,懇談表!$I$15:$M$15,0),IFERROR(MATCH(B17,懇談表!$I$16:$M$16,0),IFERROR(MATCH(B17,懇談表!$I$17:$M$17,0),IFERROR(MATCH(B17,懇談表!$I$18:$M$18,0),IFERROR(MATCH(B17,懇談表!$I$19:$M$19,0),IFERROR(MATCH(B17,懇談表!$I$20:$M$20,0),IFERROR(MATCH(B17,懇談表!$I$21:$M$21,0),IFERROR(MATCH(B17,懇談表!$I$22:$M$22,0),111))))))))))))))))),\"\")","v":""},{"$f":"IFERROR(INDEX(懇談表!$H$7:$H$36,IFERROR(MATCH($B17,懇談表!$I$7:$I$22,0),IFERROR(MATCH($B17,懇談表!$J$7:$J$22,0),IFERROR(MATCH($B17,懇談表!$K$7:$K$22,0),IFERROR(MATCH($B17,懇談表!$L$7:$L$22,0),IFERROR(MATCH($B17,懇談表!$M$7:$M$22,0),MATCH($B17,懇談表!$L$7:$L$22,0))))))),\"\")","v":""},null,null,11,{"$f":"IF(元データ!C16=\"\",\"\",元データ!C16)","v":"12:20～12:40"}]
[16,{"$f":"IF(元データ!D21=\"\",\"\",元データ!D21)","v":"岩尾憲"},{"$f":"IFERROR(INDEX(懇談表!$I$6:$M$6,IFERROR(MATCH(B18,懇談表!$I$7:$M$7,0),IFERROR(MATCH(B18,懇談表!$I$8:$M$8,0),IFERROR(MATCH(B18,懇談表!$I$9:$M$9,0),IFERROR(MATCH(B18,懇談表!$I$10:$M$10,0),IFERROR(MATCH(B18,懇談表!$I$11:$M$11,0),IFERROR(MATCH(B18,懇談表!$I$12:$M$12,0),IFERROR(MATCH(B18,懇談表!$I$13:$M$13,0),IFERROR(MATCH(B18,懇談表!$I$14:$M$14,0),IFERROR(MATCH(B18,懇談表!$I$15:$M$15,0),IFERROR(MATCH(B18,懇談表!$I$16:$M$16,0),IFERROR(MATCH(B18,懇談表!$I$17:$M$17,0),IFERROR(MATCH(B18,懇談表!$I$18:$M$18,0),IFERROR(MATCH(B18,懇談表!$I$19:$M$19,0),IFERROR(MATCH(B18,懇談表!$I$20:$M$20,0),IFERROR(MATCH(B18,懇談表!$I$21:$M$21,0),IFERROR(MATCH(B18,懇談表!$I$22:$M$22,0),111))))))))))))))))),\"\")","v":""},{"$f":"IFERROR(INDEX(懇談表!$H$7:$H$36,IFERROR(MATCH($B18,懇談表!$I$7:$I$22,0),IFERROR(MATCH($B18,懇談表!$J$7:$J$22,0),IFERROR(MATCH($B18,懇談表!$K$7:$K$22,0),IFERROR(MATCH($B18,懇談表!$L$7:$L$22,0),IFERROR(MATCH($B18,懇談表!$M$7:$M$22,0),MATCH($B18,懇談表!$L$7:$L$22,0))))))),\"\")","v":""},null,null,12,{"$f":"IF(元データ!C17=\"\",\"\",元データ!C17)","v":"12:40～13:00"}]
[17,{"$f":"IF(元データ!D22=\"\",\"\",元データ!D22)","v":"渡井理己"},{"$f":"IFERROR(INDEX(懇談表!$I$6:$M$6,IFERROR(MATCH(B19,懇談表!$I$7:$M$7,0),IFERROR(MATCH(B19,懇談表!$I$8:$M$8,0),IFERROR(MATCH(B19,懇談表!$I$9:$M$9,0),IFERROR(MATCH(B19,懇談表!$I$10:$M$10,0),IFERROR(MATCH(B19,懇談表!$I$11:$M$11,0),IFERROR(MATCH(B19,懇談表!$I$12:$M$12,0),IFERROR(MATCH(B19,懇談表!$I$13:$M$13,0),IFERROR(MATCH(B19,懇談表!$I$14:$M$14,0),IFERROR(MATCH(B19,懇談表!$I$15:$M$15,0),IFERROR(MATCH(B19,懇談表!$I$16:$M$16,0),IFERROR(MATCH(B19,懇談表!$I$17:$M$17,0),IFERROR(MATCH(B19,懇談表!$I$18:$M$18,0),IFERROR(MATCH(B19,懇談表!$I$19:$M$19,0),IFERROR(MATCH(B19,懇談表!$I$20:$M$20,0),IFERROR(MATCH(B19,懇談表!$I$21:$M$21,0),IFERROR(MATCH(B19,懇談表!$I$22:$M$22,0),111))))))))))))))))),\"\")","v":""},{"$f":"IFERROR(INDEX(懇談表!$H$7:$H$36,IFERROR(MATCH($B19,懇談表!$I$7:$I$22,0),IFERROR(MATCH($B19,懇談表!$J$7:$J$22,0),IFERROR(MATCH($B19,懇談表!$K$7:$K$22,0),IFERROR(MATCH($B19,懇談表!$L$7:$L$22,0),IFERROR(MATCH($B19,懇談表!$M$7:$M$22,0),MATCH($B19,懇談表!$L$7:$L$22,0))))))),\"\")","v":""},null,null,13,{"$f":"IF(元データ!C18=\"\",\"\",元データ!C18)","v":"13:00～13:20"}]
[18,{"$f":"IF(元データ!D23=\"\",\"\",元データ!D23)","v":"島屋八徳"},{"$f":"IFERROR(INDEX(懇談表!$I$6:$M$6,IFERROR(MATCH(B20,懇談表!$I$7:$M$7,0),IFERROR(MATCH(B20,懇談表!$I$8:$M$8,0),IFERROR(MATCH(B20,懇談表!$I$9:$M$9,0),IFERROR(MATCH(B20,懇談表!$I$10:$M$10,0),IFERROR(MATCH(B20,懇談表!$I$11:$M$11,0),IFERROR(MATCH(B20,懇談表!$I$12:$M$12,0),IFERROR(MATCH(B20,懇談表!$I$13:$M$13,0),IFERROR(MATCH(B20,懇談表!$I$14:$M$14,0),IFERROR(MATCH(B20,懇談表!$I$15:$M$15,0),IFERROR(MATCH(B20,懇談表!$I$16:$M$16,0),IFERROR(MATCH(B20,懇談表!$I$17:$M$17,0),IFERROR(MATCH(B20,懇談表!$I$18:$M$18,0),IFERROR(MATCH(B20,懇談表!$I$19:$M$19,0),IFERROR(MATCH(B20,懇談表!$I$20:$M$20,0),IFERROR(MATCH(B20,懇談表!$I$21:$M$21,0),IFERROR(MATCH(B20,懇談表!$I$22:$M$22,0),111))))))))))))))))),\"\")","v":""},{"$f":"IFERROR(INDEX(懇談表!$H$7:$H$36,IFERROR(MATCH($B20,懇談表!$I$7:$I$22,0),IFERROR(MATCH($B20,懇談表!$J$7:$J$22,0),IFERROR(MATCH($B20,懇談表!$K$7:$K$22,0),IFERROR(MATCH($B20,懇談表!$L$7:$L$22,0),IFERROR(MATCH($B20,懇談表!$M$7:$M$22,0),MATCH($B20,懇談表!$L$7:$L$22,0))))))),\"\")","v":""},null,null,14,{"$f":"IF(元データ!C19=\"\",\"\",元データ!C19)","v":"13:20～13:40"}]
{"$rows_left_out":26}
{"sheet":"案内状","index":2,"n_rows":22,"n_cols":10,"rows_kept":22,"merged":[[2,8,2,9],[7,4,7,7],[9,2,9,9]]}
[3]
[]
[{"$nulls":8},"2020-07-10"]
[null,null,"保護者のみなさまへ"]
[{"$nulls":9},"○○ 小 学 校 長    □□　▲▲"]
[{"$nulls":9},"６年１組　担任　 ◇◇　△△"]
[]
[{"$nulls":4},"個人懇談について（二次案内）"]
[]
[null,null,"  盛夏の候，保護者のみなさまにおかれましては益々ご健勝にてお過ごしのことと拝察いたします。日頃は本校教育の諸活動に対しまして，ご協力・ご支援を賜り厚くお礼申しあげます。\n　さて，個人懇談の日時が決まりました。ご多用とは存じますが，下の日時に合わせてご来校くださいますようお願いいたします。"]
[]
[]
[{"$nulls":3},"１ 児童氏名",null,{"$f":"INDEX(懇談表!$B$3:$D$31,$A$1,1)","v":"松澤香輝"}]
[]
[]
[{"$nulls":3},"２ 懇談日時",null,{"$f":"INDEX(懇談表!$B$3:$D$31,$A$1,2)","v":"8月24日（月）"},{"$f":"INDEX(懇談表!$B$3:$D$31,$A$1,3)","v":"9:00:～9:20:"}]
[]
[]
[{"$nulls":3},"３ 懇談場所",null,"５年松組教室"]
[]
{"$rows_left_out":3}
{"sheet":"使用方法","index":3,"n_rows":12,"n_cols":3,"rows_kept":12}
[]
[]
[null,"懇談表・案内状作成アプリの使用方法"]
[]
[null,1,"このアプリは、エクセルにより懇談表や家庭訪問などの予定表、案内状を作成するとき等に使用してください。"]
[null,2,"初期設定として、メニュー表示からシート保護解除ボタンをクリックして、元データシートにデータを入力します。また、案内状の文面を作成（修正）します。"]
[null,3,"先ず懇談日を入力し、開始時刻は懇談開始時刻、懇談時間は、20分は、0:20と入力、そして１日の懇談回数を入力して面談時間作成ボタンをクリックしてください。"]
[null,4,"①懇談日時5日間まで対応②氏名４０人まで対応③懇談人数は40人まで対応"]
[null,5,"使用は、懇談表シートの懇談表に懇談日時の決まった児童・生徒の氏名をリストで入力していきます。"]
[null,6,"案内状シートのメニューから各個人用の案内状が印刷できます。印刷は個人単位、全員一括どちらでも可能です。"]
[null,7,"各シートは、保護がかかっいるので、メニューから保護の解除ボタンで解除してから、案内状の作成は行ってください。"]
[null,8,"シート見出しが、青色時は保護設定時、色無しは解除時となっています。ファイルを開くときに自動的にシートは保護されます。"]